Target
Procathepsin L
Ligand
BDBM19746
Substrate
Meas. Tech.
ChEMBL_306405 (CHEMBL828746)
IC50
89±n/a nM
Citation
 Altmann, ECowan-Jacob, SWMissbach, M Novel purine nitrile derived inhibitors of the cysteine protease cathepsin K. J Med Chem 47:5833-6 (2004)  
Target
Name:
Procathepsin L
Synonyms:
CATL1_HUMAN CTSL CTSL1 Cathepsin L Cathepsin L1 heavy chain MEP cathepsin L preproprotein
Type:
Enzyme
Mol. Mass.:
37557.19
Organism:
Homo sapiens (Human)
Description:
Purchased from Calbiochem (San Diego, CA).
Residue:
333
  
Inhibitor
Name:
BDBM19746
Synonyms:
6-(cyclohexylamino)-9-[2-(4-methylpiperazin-1-yl)ethyl]-9H-purine-2-carbonitrile NVP-ABE854 | Purine lead structure, 1
Type:
Small organic molecule
Emp. Form.:
C19H28N8
Mol. Mass.:
368.4792
SMILES:
CN1CCN(CCn2cnc3c(NC4CCCCC4)nc(nc23)C#N)CC1
: