Target
Bifunctional epoxide hydrolase 2
Ligand
BDBM50586952
Substrate
Meas. Tech.
ChEMBL_2170254 (CHEMBL5055313)
IC50
6.0±n/a nM
Citation
 Lillich, FFWillems, SNi, XKilu, WBorkowsky, CBrodsky, MKramer, JSBrunst, SHernandez-Olmos, VHeering, JSchierle, SKestner, RIMayser, FMHelmstädter, MGöbel, TWeizel, LNamgaladze, DKaiser, ASteinhilber, DPfeilschifter, WKahnt, ASProschak, AChaikuad, AKnapp, SMerk, DProschak, E Structure-Based Design of Dual Partial Peroxisome Proliferator-Activated Receptor ? Agonists/Soluble Epoxide Hydrolase Inhibitors. J Med Chem 64:17259-17276 (2021)  
Target
Name:
Bifunctional epoxide hydrolase 2
Synonyms:
Cytosolic epoxide hydrolase 2 EPHX2 HYES_HUMAN Soluble epoxide hydrolase (sEH) | epoxide hydrolase 2, cytoplasmic
Type:
Enzyme
Mol. Mass.:
62613.07
Organism:
Homo sapiens (Human)
Description:
P34913
Residue:
555
  
Inhibitor
Name:
BDBM50586952
Synonyms:
CHEMBL5094953
Type:
Small organic molecule
Emp. Form.:
C25H22ClFN2O3S
Mol. Mass.:
484.97
SMILES:
CS(=O)(=O)Cc1ccc(CNC(=O)c2ccc3n(Cc4cccc(F)c4)ccc3c2)c(Cl)c1
: