Target
Bifunctional epoxide hydrolase 2
Ligand
BDBM50586955
Substrate
Meas. Tech.
ChEMBL_2170254 (CHEMBL5055313)
IC50
4.0±n/a nM
Citation
 Lillich, FFWillems, SNi, XKilu, WBorkowsky, CBrodsky, MKramer, JSBrunst, SHernandez-Olmos, VHeering, JSchierle, SKestner, RIMayser, FMHelmstädter, MGöbel, TWeizel, LNamgaladze, DKaiser, ASteinhilber, DPfeilschifter, WKahnt, ASProschak, AChaikuad, AKnapp, SMerk, DProschak, E Structure-Based Design of Dual Partial Peroxisome Proliferator-Activated Receptor ? Agonists/Soluble Epoxide Hydrolase Inhibitors. J Med Chem 64:17259-17276 (2021)  
Target
Name:
Bifunctional epoxide hydrolase 2
Synonyms:
Cytosolic epoxide hydrolase 2 EPHX2 HYES_HUMAN Soluble epoxide hydrolase (sEH) | epoxide hydrolase 2, cytoplasmic
Type:
Enzyme
Mol. Mass.:
62613.07
Organism:
Homo sapiens (Human)
Description:
P34913
Residue:
555
  
Inhibitor
Name:
BDBM50586955
Synonyms:
CHEMBL5090873
Type:
Small organic molecule
Emp. Form.:
C26H20F4N2O4S
Mol. Mass.:
532.507
SMILES:
CS(=O)(=O)Cc1ccc(CNC(=O)c2ccc3n(ccc3c2)C(=O)c2cccc(F)c2)c(c1)C(F)(F)F
: