Target
Bifunctional epoxide hydrolase 2
Ligand
BDBM50586963
Substrate
Meas. Tech.
ChEMBL_2170254 (CHEMBL5055313)
IC50
3.0±n/a nM
Citation
 Lillich, FFWillems, SNi, XKilu, WBorkowsky, CBrodsky, MKramer, JSBrunst, SHernandez-Olmos, VHeering, JSchierle, SKestner, RIMayser, FMHelmstädter, MGöbel, TWeizel, LNamgaladze, DKaiser, ASteinhilber, DPfeilschifter, WKahnt, ASProschak, AChaikuad, AKnapp, SMerk, DProschak, E Structure-Based Design of Dual Partial Peroxisome Proliferator-Activated Receptor ? Agonists/Soluble Epoxide Hydrolase Inhibitors. J Med Chem 64:17259-17276 (2021)  
Target
Name:
Bifunctional epoxide hydrolase 2
Synonyms:
Cytosolic epoxide hydrolase 2 EPHX2 HYES_HUMAN Soluble epoxide hydrolase (sEH) | epoxide hydrolase 2, cytoplasmic
Type:
Enzyme
Mol. Mass.:
62613.07
Organism:
Homo sapiens (Human)
Description:
P34913
Residue:
555
  
Inhibitor
Name:
BDBM50586963
Synonyms:
CHEMBL5090087
Type:
Small organic molecule
Emp. Form.:
C25H21F9N2O3S
Mol. Mass.:
600.496
SMILES:
FC(F)(F)C(Cn1ccc2cc(ccc12)C(=O)NCc1ccc(CS(=O)(=O)C2CC2)cc1C(F)(F)F)C(F)(F)F
: