Target
5-hydroxytryptamine receptor 1D
Ligand
BDBM50130461
Substrate
Meas. Tech.
ChEMBL_302836 (CHEMBL827881)
Ki
430±n/a nM
Citation
 Zhang, DKohlman, DKrushinski, JLiang, SYing, BPReilly, JEDinn, SRWainscott, DBNutter, SGough, WNelson, DLSchaus, JMXu, YC Design, synthesis and evaluation of bicyclic benzamides as novel 5-HT1F receptor agonists. Bioorg Med Chem Lett 14:6011-6 (2004)  
Target
Name:
5-hydroxytryptamine receptor 1D
Synonyms:
5-HT-1D 5-HT1D 5HT1D_HUMAN HTR1DA Serotonin (5-HT) receptor | Serotonin Receptor 1D
Type:
G Protein-Coupled Receptor (GPCR)
Mol. Mass.:
41920.63
Organism:
Homo sapiens (Human)
Description:
Receptor binding assays were performed using human clone stably expressed in CHO cells.
Residue:
377
  
Inhibitor
Name:
BDBM50130461
Synonyms:
4-Fluoro-N-[3-(1-methyl-4-piperidinyl)-1H-indol-5-yl]benzamide CHEMBL101690 | LY-334370
Type:
Small organic molecule
Emp. Form.:
C21H22FN3O
Mol. Mass.:
351.4173
SMILES:
CN1CCC(CC1)c1c[nH]c2ccc(NC(=O)c3ccc(F)cc3)cc12
: