Target
Sodium channel protein type 1 subunit alpha
Ligand
BDBM145285
Substrate
Meas. Tech.
ChEMBL_2170564 (CHEMBL5055698)
IC50
11±n/a nM
Target
Name:
Sodium channel protein type 1 subunit alpha
Synonyms:
NAC1 SCN1A Sodium (Site 1) Sodium channel protein type 1 subunit alpha Sodium channel protein type I subunit alpha Voltage-gated sodium channel subunit alpha Nav1.1
Type:
Protein
Mol. Mass.:
228952.47
Organism:
Homo sapiens (Human)
Description:
P35498
Residue:
2009
  
Inhibitor
Name:
BDBM145285
Synonyms:
US8952169, 64 | US9771376, Example 64
Type:
Small organic molecule
Emp. Form.:
C24H31FN2O4S
Mol. Mass.:
462.577
SMILES:
Fc1cc(OCC23CC4CC(CC(C4)C2)C3)c(cc1C(=O)NS(=O)(=O)N1CCC1)C1CC1
: