Target
Sodium/bile acid cotransporter
Ligand
BDBM50157078
Substrate
Meas. Tech.
ChEMBL_306878 (CHEMBL828684)
IC50
1600±n/a nM
Citation
 Bhat, LJandeleit, BDias, TMMoors, TLGallop, MA Synthesis and biological evaluation of novel steroidal pyrazoles as substrates for bile acid transporters. Bioorg Med Chem Lett 15:85-7 (2004)  
Target
Name:
Sodium/bile acid cotransporter
Synonyms:
Bile acid transporter NTCP_HUMAN | SLC10A1
Type:
PROTEIN
Mol. Mass.:
38131.81
Organism:
Homo sapiens (Human)
Description:
ChEMBL_838517
Residue:
349
  
Inhibitor
Name:
BDBM50157078
Synonyms:
CHEMBL185179 | [(R)-4-((10aS,12aR)-10a,12a-Dimethyl-1,2,3,3a,3b,4,5,5a,6,8,10,10a,10b,11,12,12a-hexadecahydro-7,8-diaza-dicyclopenta[a,h]phenanthren-1-yl)-pentanoylamino]-acetic acid
Type:
Small organic molecule
Emp. Form.:
C27H41N3O3
Mol. Mass.:
455.6327
SMILES:
C[C@H](CCC(=O)NCC(O)=O)C1CCC2C3CCC4Cc5[nH]ncc5C[C@]4(C)C3CC[C@]12C
: