Target
Fatty-acid amide hydrolase 1 [30-579]
Ligand
BDBM50157117
Substrate
Meas. Tech.
ChEMBL_303653 (CHEMBL829001)
Ki
80000±n/a nM
Citation
 Du, WHardouin, CCheng, HHwang, IBoger, DL Heterocyclic sulfoxide and sulfone inhibitors of fatty acid amide hydrolase. Bioorg Med Chem Lett 15:103-6 (2004)  
Target
Name:
Fatty-acid amide hydrolase 1 [30-579]
Synonyms:
Anandamide amidohydrolase 1 Faah Fatty Acid Amide Hydrolase Fatty-acid amide hydrolase (FAAH) Fatty-acid amide hydrolase 1 (FAAH) Oleamide hydrolase 1
Type:
Single-pass membrane protein; homodimer
Mol. Mass.:
60474.00
Organism:
Rattus norvegicus (rat)
Description:
P97612 (aa 30-579)
Residue:
550
  
Inhibitor
Name:
BDBM50157117
Synonyms:
2''-(6-Phenyl-hexylsulfanyl)-[4,5'']bioxazolyl | CHEMBL183145
Type:
Small organic molecule
Emp. Form.:
C18H20N2O2S
Mol. Mass.:
328.429
SMILES:
C(CCCc1ccccc1)CCSc1ncc(o1)-c1cocn1
: