Target
Fatty-acid amide hydrolase 1 [30-579]
Ligand
BDBM50157118
Substrate
Meas. Tech.
ChEMBL_303653 (CHEMBL829001)
Ki
2200±n/a nM
Citation
 Du, WHardouin, CCheng, HHwang, IBoger, DL Heterocyclic sulfoxide and sulfone inhibitors of fatty acid amide hydrolase. Bioorg Med Chem Lett 15:103-6 (2004)  
Target
Name:
Fatty-acid amide hydrolase 1 [30-579]
Synonyms:
Anandamide amidohydrolase 1 Faah Fatty Acid Amide Hydrolase Fatty-acid amide hydrolase (FAAH) Fatty-acid amide hydrolase 1 (FAAH) Oleamide hydrolase 1
Type:
Single-pass membrane protein; homodimer
Mol. Mass.:
60474.00
Organism:
Rattus norvegicus (rat)
Description:
P97612 (aa 30-579)
Residue:
550
  
Inhibitor
Name:
BDBM50157118
Synonyms:
2''-[((Z)-Heptadec-8-ene)-1-sulfinyl]-[4,5'']bioxazolyl | CHEMBL181395
Type:
Small organic molecule
Emp. Form.:
C23H36N2O3S
Mol. Mass.:
420.609
SMILES:
CCCCCCCC\C=C/CCCCCCCS(=O)c1ncc(o1)-c1cocn1
: