Target
Fatty-acid amide hydrolase 1 [30-579]
Ligand
BDBM50157119
Substrate
Meas. Tech.
ChEMBL_303653 (CHEMBL829001)
Ki
2600±n/a nM
Citation
 Du, WHardouin, CCheng, HHwang, IBoger, DL Heterocyclic sulfoxide and sulfone inhibitors of fatty acid amide hydrolase. Bioorg Med Chem Lett 15:103-6 (2004)  
Target
Name:
Fatty-acid amide hydrolase 1 [30-579]
Synonyms:
Anandamide amidohydrolase 1 Faah Fatty Acid Amide Hydrolase Fatty-acid amide hydrolase (FAAH) Fatty-acid amide hydrolase 1 (FAAH) Oleamide hydrolase 1
Type:
Single-pass membrane protein; homodimer
Mol. Mass.:
60474.00
Organism:
Rattus norvegicus (rat)
Description:
P97612 (aa 30-579)
Residue:
550
  
Inhibitor
Name:
BDBM50157119
Synonyms:
2-(5-Phenyl-pentane-1-sulfinyl)-benzooxazole | CHEMBL359694
Type:
Small organic molecule
Emp. Form.:
C18H19NO2S
Mol. Mass.:
313.414
SMILES:
O=S(CCCCCc1ccccc1)c1nc2ccccc2o1
: