Target
Fatty-acid amide hydrolase 1 [30-579]
Ligand
BDBM50157120
Substrate
Meas. Tech.
ChEMBL_303653 (CHEMBL829001)
Ki
3±n/a nM
Citation
 Du, WHardouin, CCheng, HHwang, IBoger, DL Heterocyclic sulfoxide and sulfone inhibitors of fatty acid amide hydrolase. Bioorg Med Chem Lett 15:103-6 (2004)  
Target
Name:
Fatty-acid amide hydrolase 1 [30-579]
Synonyms:
Anandamide amidohydrolase 1 Faah Fatty Acid Amide Hydrolase Fatty-acid amide hydrolase (FAAH) Fatty-acid amide hydrolase 1 (FAAH) Oleamide hydrolase 1
Type:
Single-pass membrane protein; homodimer
Mol. Mass.:
60474.00
Organism:
Rattus norvegicus (rat)
Description:
P97612 (aa 30-579)
Residue:
550
  
Inhibitor
Name:
BDBM50157120
Synonyms:
(9Z)-1-(5-pyridin-2-yl-1,3,4-oxadiazol-2-yl)octadec-9-en-1-one (Z)-1-(5-Pyridin-2-yl-[1,3,4]oxadiazol-2-yl)-octadec-9-en-1-one 1-(5-Pyridin-2-yl-[1,3,4]oxadiazol-2-yl)-octadec-9-en-1-one | CHEMBL178563
Type:
Small organic molecule
Emp. Form.:
C25H37N3O2
Mol. Mass.:
411.5802
SMILES:
CCCCCCCC\C=C/CCCCCCCC(=O)c1nnc(o1)-c1ccccn1
: