Target
Fatty-acid amide hydrolase 1 [30-579]
Ligand
BDBM50157134
Substrate
Meas. Tech.
ChEMBL_303653 (CHEMBL829001)
Ki
8000±n/a nM
Citation
 Du, WHardouin, CCheng, HHwang, IBoger, DL Heterocyclic sulfoxide and sulfone inhibitors of fatty acid amide hydrolase. Bioorg Med Chem Lett 15:103-6 (2004)  
Target
Name:
Fatty-acid amide hydrolase 1 [30-579]
Synonyms:
Anandamide amidohydrolase 1 Faah Fatty Acid Amide Hydrolase Fatty-acid amide hydrolase (FAAH) Fatty-acid amide hydrolase 1 (FAAH) Oleamide hydrolase 1
Type:
Single-pass membrane protein; homodimer
Mol. Mass.:
60474.00
Organism:
Rattus norvegicus (rat)
Description:
P97612 (aa 30-579)
Residue:
550
  
Inhibitor
Name:
BDBM50157134
Synonyms:
5-Furan-2-yl-2-[((Z)-heptadec-8-ene)-1-sulfinyl]-oxazole | CHEMBL426968
Type:
Small organic molecule
Emp. Form.:
C24H37NO3S
Mol. Mass.:
419.62
SMILES:
CCCCCCCC\C=C/CCCCCCCS(=O)c1ncc(o1)-c1ccco1
: