Target
Protein farnesyltransferase subunit beta/geranylgeranyltransferase type-1 subunit alpha
Ligand
BDBM13389
Substrate
Meas. Tech.
ChEMBL_305598 (CHEMBL828044)
IC50
0.2±n/a nM
Citation
 Wang, GTWang, XWang, WHasvold, LASullivan, GHutchins, CWO'Conner, SGentiles, RSowin, TCohen, JGu, WZZhang, HRosenberg, SHSham, HL Design and synthesis of o-trifluoromethylbiphenyl substituted 2-amino-nicotinonitriles as inhibitors of farnesyltransferase. Bioorg Med Chem Lett 15:153-8 (2004)  
Target
Name:
Protein farnesyltransferase subunit beta/geranylgeranyltransferase type-1 subunit alpha
Synonyms:
Protein Farnesyltransferase (PFT) | Protein farnesyltransferase
Type:
Protein Complex
Mol. Mass.:
Description:
Purified bovine brain FTase.
Components:
This complex has 2 components.
Component 1
Name:
Protein farnesyltransferase/geranylgeranyltransferase type-1 subunit alpha
Synonyms:
CAAX farnesyltransferase alpha subunit FNTA_BOVIN GGTase-I-alpha Protein Farnesyltransferase (PFT) Chain A Protein farnesyltransferase/geranylgeranyltransferase type I alpha subunit Type I protein geranyl-geranyltransferase alpha subunit
Type:
Enzyme
Mol. Mass.:
43827.38
Organism:
Bos taurus (bovine)
Description:
The enzyme was purified from a bovine brain homogenate by sequential ammonium sulfate fractionation and affinity chromatography.
Residue:
375
  
Component 2
Name:
Protein farnesyltransferase subunit beta
Synonyms:
CAAX farnesyltransferase subunit beta FNTB_BOVIN Protein farnesyltransferase Protein farnesyltransferase subunit beta Ras proteins prenyltransferase subunit beta
Type:
Enzyme Subunit
Mol. Mass.:
48758.49
Organism:
Bos taurus (bovine)
Description:
Protein farnesyltransferase subunit beta
Residue:
437
  
Inhibitor
Name:
BDBM13389
Synonyms:
4-{[(4-cyanophenyl)methoxy](1-methyl-1H-imidazol-5-yl)methyl}-2-(naphthalen-1-yl)benzonitrile CHEMBL41748
Type:
Small organic molecule
Emp. Form.:
C30H22N4O
Mol. Mass.:
454.5219
SMILES:
Cn1cncc1C(OCc1ccc(cc1)C#N)c1ccc(C#N)c(c1)-c1cccc2ccccc12
: