Target
Tubulin beta-1 chain
Ligand
BDBM50064482
Substrate
Meas. Tech.
ChEMBL_305242 (CHEMBL833500)
IC50
1500±n/a nM
Citation
 Nakagawa-Goto, KChen, CXHamel, EWu, CCBastow, KFBrossi, ALee, KH Antitumor agents. Part 236: Synthesis of water-soluble colchicine derivatives. Bioorg Med Chem Lett 15:235-8 (2004)  
Target
Name:
Tubulin beta-1 chain
Synonyms:
TBB1_HUMAN | TUBB1
Type:
PROTEIN
Mol. Mass.:
50311.77
Organism:
Homo sapiens (Human)
Description:
ChEMBL_305173
Residue:
451
  
Inhibitor
Name:
BDBM50064482
Synonyms:
2-demethylthiocolchicine N-((S)-2-hydroxy-1,3-dimethoxy-10-methylsulfanyl-9-oxo-5,6,7,9-tetrahydro-benzo[a]heptalen-7-yl)-acetamide | N-(2-Hydroxy-1,3-dimethoxy-10-methylsulfanyl-9-oxo-5,6,7,9-tetrahydro-benzo[a]heptalen-7-yl)-acetamide
Type:
Small organic molecule
Emp. Form.:
C21H23NO5S
Mol. Mass.:
401.476
SMILES:
COc1cc2CC[C@H](NC(C)=O)c3cc(=O)c(SC)ccc3-c2c(OC)c1O
: