Target
Caspase-3
Ligand
BDBM50157539
Substrate
Meas. Tech.
ChEMBL_430008 (CHEMBL916261)
Ki
3.2±n/a nM
Citation
 Micale, NVairagoundar, RYakovlev, AGKozikowski, AP Design and synthesis of a potent and selective peptidomimetic inhibitor of caspase-3. J Med Chem 47:6455-8 (2004)  
Target
Name:
Caspase-3
Synonyms:
Apopain CASP3 CPP-32 Caspase 3 Caspase-3 subunit p17 SCA-1 Yama protein | caspase-3 preproprotein
Type:
Hydrolase; heterotetramer of two heterodimers
Mol. Mass.:
31607.55
Organism:
Homo sapiens (Human)
Description:
Residue:
277
  
Inhibitor
Name:
BDBM50157539
Synonyms:
Ac-Asp-Glu-Val-Asp-CHO | CHEMBL225647
Type:
Small organic molecule
Emp. Form.:
C19H28N4O11
Mol. Mass.:
488.4458
SMILES:
CC(C)[C@H](NC(=O)[C@H](CC(O)=O)NC(=O)[C@H](CC(O)=O)NC(C)=O)C(=O)N[C@@H](CC(O)=O)C=O
: