Target
Androgen receptor
Ligand
BDBM50158078
Substrate
Meas. Tech.
ChEMBL_303028 (CHEMBL830415)
Ki
46±n/a nM
Citation
 Salvati, MEBalog, AWei, DDPickering, DAttar, RMGeng, JRizzo, CAHunt, JTGottardis, MMWeinmann, RMartinez, R Identification of a novel class of androgen receptor antagonists based on the bicyclic-1H-isoindole-1,3(2H)-dione nucleus. Bioorg Med Chem Lett 15:389-93 (2004)  
Target
Name:
Androgen receptor
Synonyms:
ANDR_HUMAN Androgen Receptor Androgen receptor/Baculoviral IAP repeat-containing protein 2 Dihydrotestosterone receptor Nuclear receptor subfamily 3 group C member 4
Type:
Receptor
Mol. Mass.:
99185.27
Organism:
Homo sapiens (Human)
Description:
CHO cells were stably transfected with human AR gene.
Residue:
920
  
Inhibitor
Name:
BDBM50158078
Synonyms:
(2S,6R)-4-(4-Bromo-3-trifluoromethyl-phenyl)-4-aza-tricyclo[5.2.1.0*2,6*]dec-8-ene-3,5-dione | CHEMBL361222
Type:
Small organic molecule
Emp. Form.:
C16H11BrF3NO2
Mol. Mass.:
386.163
SMILES:
Oc1c2C3CC(C=C3)c2c(O)n1-c1ccc(Br)c(c1)C(F)(F)F
: