Target
Bromodomain-containing protein 3
Ligand
BDBM50569836
Substrate
Meas. Tech.
ChEMBL_2185066 (CHEMBL5097148)
IC50
11±n/a nM
Citation
 Ren, QGao, W Current status in the discovery of dual BET/HDAC inhibitors. Bioorg Med Chem Lett 38:0 (2021) Target
Name:
Bromodomain-containing protein 3
Synonyms:
BRD3 Bromodomain and extra-terminal motif (BET) Bromodomain-containing protein 3 (BRD3) RING3-like protein | RING3L
Type:
Protein
Mol. Mass.:
79571.81
Organism:
Homo sapiens (Human)
Description:
Q15059
Residue:
726
  
Inhibitor
Name:
BDBM50569836
Synonyms:
CHEMBL4850926
Type:
Small organic molecule
Emp. Form.:
C26H23ClN6O3S
Mol. Mass.:
535.017
SMILES:
Cc1sc-2c(c1C)C(=N[C@@H](CC(=O)Nc1ccc(cc1)C(=O)NO)c1nnc(C)n-21)c1ccc(Cl)cc1
: