Target
Transitional endoplasmic reticulum ATPase
Ligand
BDBM50500325
Substrate
Meas. Tech.
ChEMBL_2185521 (CHEMBL5097603)
IC50
11±n/a nM
Citation
 Zhang, GLi, SCheng, KWChou, TF AAA ATPases as therapeutic targets: Structure, functions, and small-molecule inhibitors. Eur J Med Chem 219:0 (2021) Target
Name:
Transitional endoplasmic reticulum ATPase
Synonyms:
TERA_HUMAN VCP Valosin-containing protein
Type:
Enzyme
Mol. Mass.:
89300.63
Organism:
Homo sapiens (Human)
Description:
P55072
Residue:
806
  
Inhibitor
Name:
BDBM50500325
Synonyms:
Cb 5083 | Cb-5083
Type:
Small organic molecule
Emp. Form.:
C24H23N5O2
Mol. Mass.:
413.4717
SMILES:
Cc1cc2c(cccc2n1-c1nc2CCOCc2c(NCc2ccccc2)n1)C(N)=O
: