Target
Transitional endoplasmic reticulum ATPase
Ligand
BDBM50514004
Substrate
Meas. Tech.
ChEMBL_2185538 (CHEMBL5097620)
IC50
8.0±n/a nM
Citation
 Zhang, GLi, SCheng, KWChou, TF AAA ATPases as therapeutic targets: Structure, functions, and small-molecule inhibitors. Eur J Med Chem 219:0 (2021) Target
Name:
Transitional endoplasmic reticulum ATPase
Synonyms:
TERA_HUMAN VCP Valosin-containing protein
Type:
Enzyme
Mol. Mass.:
89300.63
Organism:
Homo sapiens (Human)
Description:
P55072
Residue:
806
  
Inhibitor
Name:
BDBM50514004
Synonyms:
CHEMBL4476693
Type:
Small organic molecule
Emp. Form.:
C30H33F2N5O3S
Mol. Mass.:
590.732
SMILES:
[2H]C1([2H])C([2H])([2H])C([2H])([2H])C([2H])(Sc2ncc(COc3cc(F)c(cc3F)C#CCOC(=O)NC3CCN(C)CC3)n2-c2cccnc2)C1([2H])[2H]
: