Target
Transitional endoplasmic reticulum ATPase
Ligand
BDBM50587862
Substrate
Meas. Tech.
ChEMBL_2185538 (CHEMBL5097620)
IC50
7.0±n/a nM
Citation
 Zhang, GLi, SCheng, KWChou, TF AAA ATPases as therapeutic targets: Structure, functions, and small-molecule inhibitors. Eur J Med Chem 219:0 (2021) Target
Name:
Transitional endoplasmic reticulum ATPase
Synonyms:
TERA_HUMAN VCP Valosin-containing protein
Type:
Enzyme
Mol. Mass.:
89300.63
Organism:
Homo sapiens (Human)
Description:
P55072
Residue:
806
  
Inhibitor
Name:
BDBM50587862
Synonyms:
CHEMBL5206855
Type:
Small organic molecule
Emp. Form.:
C28H34N4OS
Mol. Mass.:
474.661
SMILES:
CC(C)NCCC#Cc1ccc(OCc2cnc(SC3CCCC3)n2-c2cccnc2)cc1C
: