Target
Cytochrome c oxidase subunit 2
Ligand
BDBM11639
Substrate
Meas. Tech.
ChEMBL_2185785 (CHEMBL5097867)
IC50
160±n/a nM
Citation
 Neha, KWakode, S Contemporary advances of cyclic molecules proposed for inflammation. Eur J Med Chem 221:0 (2021) Target
Name:
Cytochrome c oxidase subunit 2
Synonyms:
COII COX2_SHEEP Cytochrome c oxidase polypeptide II MTCO2
Type:
PROTEIN
Mol. Mass.:
25987.16
Organism:
Ovis aries
Description:
ChEMBL_662815
Residue:
227
  
Inhibitor
Name:
BDBM11639
Synonyms:
4-[5-(4-methylphenyl)-3-(trifluoromethyl)-1H-pyrazol-1-yl]benzene-1-sulfonamide CLX Celecoxib US11478464, Compound Celecoxib US8741944, Comparative Compound cid_2662
Type:
Small organic molecule
Emp. Form.:
C17H14F3N3O2S
Mol. Mass.:
381.372
SMILES:
Cc1ccc(cc1)-c1cc(nn1-c1ccc(cc1)S(N)(=O)=O)C(F)(F)F
: