Target
Gamma-aminobutyric acid receptor subunit alpha-4/beta-1/delta
Ligand
BDBM50588339
Substrate
Meas. Tech.
ChEMBL_2186852 (CHEMBL5098934)
Ki
195±n/a nM
Citation
 Bavo, Fde-Jong, HPetersen, JFalk-Petersen, CBLöffler, RSparrow, ERostrup, FEliasen, JNWilhelmsen, KSBarslund, KBundgaard, CNielsen, BKristiansen, UWellendorph, PBogdanov, YFrølund, B Structure-Activity Studies of 3,9-Diazaspiro[5.5]undecane-Based ?-Aminobutyric Acid Type A Receptor Antagonists with Immunomodulatory Effect. J Med Chem 64:17795-17812 (2021) Target
Name:
Gamma-aminobutyric acid receptor subunit alpha-4/beta-1/delta
Synonyms:
Type:
Mol. Mass.:
Description:
ASSAY_ID of ChEMBL is 2186852
Components:
This complex has 3 components.
Component 1
Name:
Gamma-aminobutyric acid receptor subunit alpha-4
Synonyms:
GABA A Alpha4Beta2Gamma2 GABA A Alpha4Gamma2 GABA receptor alpha-4 subunit GABRA4 Gamma-aminobutyric acid receptor subunit alpha-4
Type:
Enzyme Catalytic Domain
Mol. Mass.:
61648.70
Organism:
Homo sapiens (Human)
Description:
GABA A Alpha4Beta2Gamma2 0 HUMAN::P48169
Residue:
554
  
Component 2
Name:
Gamma-aminobutyric acid receptor subunit delta
Synonyms:
GABA(A) receptor subunit delta GBRD_HUMAN | Gamma-aminobutyric acid receptor subunit delta
Type:
PROTEIN
Mol. Mass.:
50716.35
Organism:
Homo sapiens
Description:
ChEMBL_109656
Residue:
452
  
Component 3
Name:
Gamma-aminobutyric acid receptor subunit beta-1
Synonyms:
GABA A receptor alpha-1/beta-1/gamma-2 GABRB1 Gamma-aminobutyric acid receptor subunit beta-1
Type:
PROTEIN
Mol. Mass.:
54244.51
Organism:
Homo sapiens (Human)
Description:
EBI_11217
Residue:
474
  
Inhibitor
Name:
BDBM50588339
Synonyms:
CHEMBL5187612
Type:
Small organic molecule
Emp. Form.:
C17H24N2O
Mol. Mass.:
272.3853
SMILES:
Cc1cccc(c1)C(=O)N1CCC2(CCNCC2)CC1
: