Target
Amine oxidase [flavin-containing] A
Ligand
BDBM50159387
Substrate
Meas. Tech.
ChEMBL_302457 (CHEMBL875207)
Ki
>200000±n/a nM
Citation
 Reck, FZhou, FGirardot, MKern, GEyermann, CJHales, NJRamsay, RRGravestock, MB Identification of 4-substituted 1,2,3-triazoles as novel oxazolidinone antibacterial agents with reduced activity against monoamine oxidase A. J Med Chem 48:499-506 (2005)  
Target
Name:
Amine oxidase [flavin-containing] A
Synonyms:
AOFA_HUMAN MAO-A Monoamine oxidase Monoamine oxidase type A (MAO A) Monoamine oxidase type A (MAOA)
Type:
Protein
Mol. Mass.:
59689.53
Organism:
Homo sapiens (Human)
Description:
P21397
Residue:
527
  
Inhibitor
Name:
BDBM50159387
Synonyms:
(1-{(R)-3-[4-(1,1-Dioxo-1,2,3,6-tetrahydro-1lambda*6*-thiopyran-4-yl)-3-fluoro-phenyl]-2-oxo-oxazolidin-5-ylmethyl}-1H-[1,2,3]triazol-4-yl)-acetonitrile | CHEMBL360759
Type:
Small organic molecule
Emp. Form.:
C19H18FN5O4S
Mol. Mass.:
431.441
SMILES:
Fc1cc(ccc1C1=CCS(=O)(=O)CC1)N1C[C@H](Cn2cc(CC#N)nn2)OC1=O
: