Target
Mu-type opioid receptor
Ligand
BDBM50159681
Substrate
Meas. Tech.
ChEMBL_305952 (CHEMBL831966)
IC50
0.623±n/a nM
Citation
 Li, TFujita, YTsuda, YMiyazaki, AAmbo, ASasaki, YJinsmaa, YBryant, SDLazarus, LHOkada, Y Development of potent mu-opioid receptor ligands using unique tyrosine analogues of endomorphin-2. J Med Chem 48:586-92 (2005)  
Target
Name:
Mu-type opioid receptor
Synonyms:
M-OR-1 Mu opioid receptor OPIATE Mu OPRM_CAVPO
Type:
Enzyme Catalytic Domain
Mol. Mass.:
11165.58
Organism:
GUINEA PIG
Description:
P97266
Residue:
98
  
Inhibitor
Name:
BDBM50159681
Synonyms:
(S)-1-[2-Amino-3-(2-ethyl-4-hydroxy-6-methyl-phenyl)-propionyl]-pyrrolidine-2-carboxylic acid [(S)-1-((S)-1-carbamoyl-2-phenyl-ethylcarbamoyl)-2-phenyl-ethyl]-amide | CHEMBL175770
Type:
Small organic molecule
Emp. Form.:
C35H43N5O5
Mol. Mass.:
613.7464
SMILES:
CCc1cc(O)cc(C)c1CC(N)C(=O)N1CCC[C@H]1C(=O)N[C@@H](Cc1ccccc1)C(=O)N[C@@H](Cc1ccccc1)C(N)=O
: