Target
Methionine aminopeptidase 1
Ligand
BDBM50160043
Substrate
Meas. Tech.
ChEMBL_305881 (CHEMBL832744)
IC50
770±n/a nM
Citation
 Luo, QLLi, JYLiu, ZYChen, LLLi, JYe, QZNan, FJ Inhibitors of type I MetAPs containing pyridine-2-carboxylic acid thiazol-2-ylamide. Part 1: SAR studies on the determination of the key scaffold. Bioorg Med Chem Lett 15:635-8 (2005)  
Target
Name:
Methionine aminopeptidase 1
Synonyms:
MAP 1 MAP1_YEAST Peptidase M 1
Type:
PROTEIN
Mol. Mass.:
43382.92
Organism:
Saccharomyces cerevisiae
Description:
ChEMBL_10701
Residue:
387
  
Inhibitor
Name:
BDBM50160043
Synonyms:
3-Benzyloxy-pyridine-2-carboxylic acid thiazol-2-ylamide | CHEMBL360513
Type:
Small organic molecule
Emp. Form.:
C16H13N3O2S
Mol. Mass.:
311.358
SMILES:
O=C(Nc1nccs1)c1ncccc1OCc1ccccc1
: