Target
Methionine aminopeptidase
Ligand
BDBM50160048
Substrate
Meas. Tech.
ChEMBL_305626 (CHEMBL828659)
IC50
>100000±n/a nM
Citation
 Luo, QLLi, JYLiu, ZYChen, LLLi, JYe, QZNan, FJ Inhibitors of type I MetAPs containing pyridine-2-carboxylic acid thiazol-2-ylamide. Part 1: SAR studies on the determination of the key scaffold. Bioorg Med Chem Lett 15:635-8 (2005)  
Target
Name:
Methionine aminopeptidase
Synonyms:
EcMetAP Methionine Aminopeptidase (MAP) Peptidase M | map
Type:
Enzyme
Mol. Mass.:
29326.96
Organism:
Escherichia coli (strain K12)
Description:
Full-length untagged EcMAP was expressed in E. coli.
Residue:
264
  
Inhibitor
Name:
BDBM50160048
Synonyms:
Acetic acid 6-(thiazol-2-ylcarbamoyl)-pyridin-2-ylmethyl ester | CHEMBL181520
Type:
Small organic molecule
Emp. Form.:
C12H11N3O3S
Mol. Mass.:
277.299
SMILES:
CC(=O)OCc1cccc(n1)C(=O)Nc1nccs1
: