Target
Methionine aminopeptidase
Ligand
BDBM50129661
Substrate
Meas. Tech.
ChEMBL_305626 (CHEMBL828659)
IC50
5000±n/a nM
Citation
 Luo, QLLi, JYLiu, ZYChen, LLLi, JYe, QZNan, FJ Inhibitors of type I MetAPs containing pyridine-2-carboxylic acid thiazol-2-ylamide. Part 1: SAR studies on the determination of the key scaffold. Bioorg Med Chem Lett 15:635-8 (2005)  
Target
Name:
Methionine aminopeptidase
Synonyms:
EcMetAP Methionine Aminopeptidase (MAP) Peptidase M | map
Type:
Enzyme
Mol. Mass.:
29326.96
Organism:
Escherichia coli (strain K12)
Description:
Full-length untagged EcMAP was expressed in E. coli.
Residue:
264
  
Inhibitor
Name:
BDBM50129661
Synonyms:
CHEMBL89671 Pyridine-2-carboxylic acid thiazol-2-ylamide
Type:
Small organic molecule
Emp. Form.:
C9H7N3OS
Mol. Mass.:
205.236
SMILES:
O=C(Nc1nccs1)c1ccccn1
: