Target
Methionine aminopeptidase 1
Ligand
BDBM50160057
Substrate
Meas. Tech.
ChEMBL_305881 (CHEMBL832744)
IC50
>100000±n/a nM
Citation
 Luo, QLLi, JYLiu, ZYChen, LLLi, JYe, QZNan, FJ Inhibitors of type I MetAPs containing pyridine-2-carboxylic acid thiazol-2-ylamide. Part 1: SAR studies on the determination of the key scaffold. Bioorg Med Chem Lett 15:635-8 (2005)  
Target
Name:
Methionine aminopeptidase 1
Synonyms:
MAP 1 MAP1_YEAST Peptidase M 1
Type:
PROTEIN
Mol. Mass.:
43382.92
Organism:
Saccharomyces cerevisiae
Description:
ChEMBL_10701
Residue:
387
  
Inhibitor
Name:
BDBM50160057
Synonyms:
5-(3-Methyl-but-2-enyl)-pyridine-2-carboxylic acid thiazol-2-ylamide | CHEMBL361359
Type:
Small organic molecule
Emp. Form.:
C14H15N3OS
Mol. Mass.:
273.353
SMILES:
[#6]\[#6](-[#6])=[#6]\[#6]-c1ccc(nc1)-[#6](=O)-[#7]-c1nccs1
: