Target
Cytochrome P450 3A4
Ligand
BDBM50509150
Substrate
Meas. Tech.
ChEMBL_2192373 (CHEMBL5104733)
EC50
5500±n/a nM
Citation
 Hao, JBeck, JZhou, XLackner, GLJohnston, RReinhard, MGoldsmith, PHollinshead, SDehlinger, VFilla, SAWang, XSRichardson, JPosada, MMohutsky, MSchober, DKatner, JSChen, QHu, BRemick, DMCoates, DAMathes, BMHawk, MKSvensson, KAHembre, E Synthesis and Preclinical Characterization of LY3154885, a Human Dopamine D1 Receptor Positive Allosteric Modulator with an Improved Nonclinical Drug-Drug Interaction Risk Profile. J Med Chem 65:3786-3797 (2022) Target
Name:
Cytochrome P450 3A4
Synonyms:
Albendazole monooxygenase CP3A4_HUMAN CYP3A4 CYPIIIA4 Cytochrome P450 3A4 (CYP3A4) Nifedipine oxidase Taurochenodeoxycholate 6-alpha-hydroxylase
Type:
Enzyme
Mol. Mass.:
57349.57
Organism:
Homo sapiens (Human)
Description:
Residue:
503
  
Inhibitor
Name:
BDBM50509150
Synonyms:
LY-3154207 Mevidalen
Type:
Small organic molecule
Emp. Form.:
C24H29Cl2NO3
Mol. Mass.:
450.398
SMILES:
C[C@@H]1N([C@@H](CO)Cc2c(CCC(C)(C)O)cccc12)C(=O)Cc1c(Cl)cccc1Cl
: