Target
Voltage-dependent N-type calcium channel subunit alpha-1B
Ligand
BDBM35229
Substrate
Meas. Tech.
ChEMBL_2192630 (CHEMBL5104990)
IC50
11000±n/a nM
Citation
 Cardoso, FCSchmit, MKuiper, MJLewis, RJTuck, KLDuggan, PJ Inhibition of N-type calcium ion channels by tricyclic antidepressants - experimental and theoretical justification for their use for neuropathic pain. RSC Med Chem 13:183-195 (2022) Target
Name:
Voltage-dependent N-type calcium channel subunit alpha-1B
Synonyms:
BIII CAC1B_HUMAN CACNA1B Calcium channel (Type N) Voltage-dependent N-type calcium channel subunit alpha-1B Voltage-gated N-type calcium channel alpha-1B subunit Voltage-gated calcium channel Voltage-gated calcium channel subunit alpha Cav2.2 ((alpha 1B, beta 1b, alpha 2 delta-1) | calcium channel, voltage-dependent, N type, alpha 1B subunit
Type:
Enzyme
Mol. Mass.:
262548.16
Organism:
Homo sapiens (Human)
Description:
Q00975
Residue:
2339
  
Inhibitor
Name:
BDBM35229
Synonyms:
3-(10,11-dihydro-5H-dibenzo[b,f]azepin-5-yl)-N-methylpropan-1-amine CHEMBL72 DMI Desipramine N-(3-methylaminopropyl)iminobibenzyl demethylimipramine norimipramine
Type:
Small organic molecule
Emp. Form.:
C18H22N2
Mol. Mass.:
266.3807
SMILES:
CNCCCN1c2ccccc2CCc2ccccc12
: