Target
Telomerase reverse transcriptase
Ligand
BDBM50111322
Substrate
Meas. Tech.
ChEMBL_2193114 (CHEMBL5105474)
IC50
500±n/a nM
Citation
 Mendes, EBahls, BAljnadi, IMPaulo, A Indoloquinolines as scaffolds for the design of potent G-quadruplex ligands. Bioorg Med Chem Lett 72:0 (2022) Target
Name:
Telomerase reverse transcriptase
Synonyms:
EST2 TERT TRT
Type:
PROTEIN
Mol. Mass.:
127099.03
Organism:
Homo sapiens (Human)
Description:
ChEMBL_1447029
Residue:
1132
  
Inhibitor
Name:
BDBM50111322
Synonyms:
CHEMBL274335 | N,N-Dimethyl-N'-(11-nitro-13H-5,13-diaza-dibenzo[a,i]fluoren-6-yl)-propane-1,3-diamine
Type:
Small organic molecule
Emp. Form.:
C24H23N5O2
Mol. Mass.:
413.4717
SMILES:
CN(C)CCCNc1nc2ccccc2c2[nH]c3c(ccc4ccc(cc34)[N+]([O-])=O)c12
: