Target
Matrix metalloproteinase-9
Ligand
BDBM50160843
Substrate
Meas. Tech.
ChEMBL_302481 (CHEMBL827172)
Ki
1.9±n/a nM
Citation
 Kim, SHPudzianowski, ATLeavitt, KJBarbosa, JMcDonnell, PAMetzler, WJRankin, BMLiu, RVaccaro, WPitts, W Structure-based design of potent and selective inhibitors of collagenase-3 (MMP-13). Bioorg Med Chem Lett 15:1101-6 (2005)  
Target
Name:
Matrix metalloproteinase-9
Synonyms:
67 kDa matrix metalloproteinase-9 92 kDa gelatinase CLG4B Gelatinase B MMP9 Matrix metalloproteinase 9 (MMP-9) Matrix metalloproteinase-9 (MMP9)
Type:
Enzyme
Mol. Mass.:
78452.28
Organism:
Homo sapiens (Human)
Description:
P14780
Residue:
707
  
Inhibitor
Name:
BDBM50160843
Synonyms:
1-[4-(4-Phenoxy-phenoxy)-phenyl]-1,7,9-triaza-spiro[4.5]decane-2,6,8,10-tetraone | CHEMBL178163
Type:
Small organic molecule
Emp. Form.:
C25H19N3O6
Mol. Mass.:
457.4349
SMILES:
O=C1CCC2(N1c1ccc(Oc3ccc(Oc4ccccc4)cc3)cc1)C(=O)NC(=O)NC2=O
: