Target
Interstitial collagenase
Ligand
BDBM50160852
Substrate
Meas. Tech.
ChEMBL_302478 (CHEMBL827169)
Ki
>5000±n/a nM
Citation
 Kim, SHPudzianowski, ATLeavitt, KJBarbosa, JMcDonnell, PAMetzler, WJRankin, BMLiu, RVaccaro, WPitts, W Structure-based design of potent and selective inhibitors of collagenase-3 (MMP-13). Bioorg Med Chem Lett 15:1101-6 (2005)  
Target
Name:
Interstitial collagenase
Synonyms:
CLG MMP1 Matrix metalloproteinase-1 | Matrix metalloproteinase-1 (MMP-1)
Type:
Enzyme
Mol. Mass.:
54010.26
Organism:
Homo sapiens (Human)
Description:
P03956
Residue:
469
  
Inhibitor
Name:
BDBM50160852
Synonyms:
4-ethyl-1-(4-phenoxy-phenyl)-1,7,9-triaza-spiro[4.5]decane-2,6,8,10-tetraone | CHEMBL361527
Type:
Small organic molecule
Emp. Form.:
C21H19N3O5
Mol. Mass.:
393.3927
SMILES:
CCC1CC(=O)N(c2ccc(Oc3ccccc3)cc2)C11C(=O)NC(=O)NC1=O
: