Target
Interstitial collagenase
Ligand
BDBM11863
Substrate
Meas. Tech.
ChEMBL_302478 (CHEMBL827169)
Ki
590±n/a nM
Citation
 Kim, SHPudzianowski, ATLeavitt, KJBarbosa, JMcDonnell, PAMetzler, WJRankin, BMLiu, RVaccaro, WPitts, W Structure-based design of potent and selective inhibitors of collagenase-3 (MMP-13). Bioorg Med Chem Lett 15:1101-6 (2005)  
Target
Name:
Interstitial collagenase
Synonyms:
CLG MMP1 Matrix metalloproteinase-1 | Matrix metalloproteinase-1 (MMP-1)
Type:
Enzyme
Mol. Mass.:
54010.26
Organism:
Homo sapiens (Human)
Description:
P03956
Residue:
469
  
Inhibitor
Name:
BDBM11863
Synonyms:
4-({[4-(4-chlorophenoxy)benzene]sulfonyl}methyl)-N-hydroxyoxane-4-carboxamide RS 130830 alpha-tetrahydropyran beta-sulfone 1B
Type:
Small organic molecule
Emp. Form.:
C19H20ClNO6S
Mol. Mass.:
425.883
SMILES:
ONC(=O)C1(CS(=O)(=O)c2ccc(Oc3ccc(Cl)cc3)cc2)CCOCC1
: