Target
Steryl-sulfatase
Ligand
BDBM50161119
Substrate
Meas. Tech.
ChEMBL_302806 (CHEMBL838514)
Ki
16100±n/a nM
Citation
 Lehr, PBillich, AWolff, BNussbaumer, P N-Acyl arylsulfonamides as novel, reversible inhibitors of human steroid sulfatase. Bioorg Med Chem Lett 15:1235-8 (2005)  
Target
Name:
Steryl-sulfatase
Synonyms:
ARSC1 Arylsulfatase C STS_HUMAN Steryl-sulfate sulfohydrolase
Type:
Enzyme
Mol. Mass.:
65503.66
Organism:
Homo sapiens (Human)
Description:
P08842
Residue:
583
  
Inhibitor
Name:
BDBM50161119
Synonyms:
4-(4-Chloro-benzenesulfonylaminocarbonyl)-piperidine-1-carboxylic acid tert-butyl ester | CHEMBL181344
Type:
Small organic molecule
Emp. Form.:
C17H23ClN2O5S
Mol. Mass.:
402.893
SMILES:
CC(C)(C)OC(=O)N1CCC(CC1)C(=O)NS(=O)(=O)c1ccc(Cl)cc1
: