Target
Growth factor receptor-bound protein 2
Ligand
BDBM50161190
Substrate
Meas. Tech.
ChEMBL_302172 (CHEMBL829239)
Kd
23.8±n/a nM
Citation
 Oishi, SKarki, RGKang, SUWang, XWorthy, KMBindu, LKNicklaus, MCFisher, RJBurke, TR Design and synthesis of conformationally constrained Grb2 SH2 domain binding peptides employing alpha-methylphenylalanyl based phosphotyrosyl mimetics. J Med Chem 48:764-72 (2005)  
Target
Name:
Growth factor receptor-bound protein 2
Synonyms:
ASH GRB2 adapter protein Grb2-SH2 | Growth factor receptor-bound protein 2
Type:
Protein
Mol. Mass.:
25205.04
Organism:
Homo sapiens (Human)
Description:
P62993
Residue:
217
  
Inhibitor
Name:
BDBM50161190
Synonyms:
CHEMBL424969 | Phosphoric acid mono-[(S)-4-(2-acetylamino-2-{2-[(S)-2aarbamoyl-1-(3-naphthalen-1-yl-propylcarbamoyl)-ethylcarbamoyl]-ethylcarbamoyl -ethyl)-phenyl] ester
Type:
Small organic molecule
Emp. Form.:
C32H39N4O9P
Mol. Mass.:
654.6472
SMILES:
NC(=O)C[C@H](NC(=O)CCNC(=O)[C@@H](CC(O)=O)Cc1ccc(CP(O)(O)=O)cc1)C(=O)NCCCc1cccc2ccccc12
: