Target
Calcium/calmodulin-dependent protein kinase type 1G
Ligand
BDBM50024294
Substrate
Meas. Tech.
ChEMBL_325022 (CHEMBL860656)
Kd
4200±n/a nM
Citation
 Fabian, MABiggs, WHTreiber, DKAtteridge, CEAzimioara, MDBenedetti, MGCarter, TACiceri, PEdeen, PTFloyd, MFord, JMGalvin, MGerlach, JLGrotzfeld, RMHerrgard, SInsko, DEInsko, MALai, AGLélias, JMMehta, SAMilanov, ZVVelasco, AMWodicka, LMPatel, HKZarrinkar, PPLockhart, DJ A small molecule-kinase interaction map for clinical kinase inhibitors. Nat Biotechnol 23:329-36 (2005)  
Target
Name:
Calcium/calmodulin-dependent protein kinase type 1G
Synonyms:
CAMK1G CaM kinase I gamma VWS1
Type:
PROTEIN
Mol. Mass.:
53096.44
Organism:
Homo sapiens (Human)
Description:
ChEMBL_774599
Residue:
476
  
Inhibitor
Name:
BDBM50024294
Synonyms:
SP-600125
Type:
Small organic molecule
Emp. Form.:
C14H8N2O
Mol. Mass.:
220.2261
SMILES:
Oc1c2cccc3N=Nc(c23)c2ccccc12
: