Target
Calcium/calmodulin-dependent protein kinase type 1D
Ligand
BDBM50024294
Substrate
Meas. Tech.
ChEMBL_325025 (CHEMBL860659)
Kd
1400±n/a nM
Citation
 Fabian, MABiggs, WHTreiber, DKAtteridge, CEAzimioara, MDBenedetti, MGCarter, TACiceri, PEdeen, PTFloyd, MFord, JMGalvin, MGerlach, JLGrotzfeld, RMHerrgard, SInsko, DEInsko, MALai, AGLélias, JMMehta, SAMilanov, ZVVelasco, AMWodicka, LMPatel, HKZarrinkar, PPLockhart, DJ A small molecule-kinase interaction map for clinical kinase inhibitors. Nat Biotechnol 23:329-36 (2005)  
Target
Name:
Calcium/calmodulin-dependent protein kinase type 1D
Synonyms:
CAMK1D CaM kinase I delta | KCC1D_HUMAN
Type:
PROTEIN
Mol. Mass.:
42916.83
Organism:
Homo sapiens (Human)
Description:
ChEMBL_586559
Residue:
385
  
Inhibitor
Name:
BDBM50024294
Synonyms:
SP-600125
Type:
Small organic molecule
Emp. Form.:
C14H8N2O
Mol. Mass.:
220.2261
SMILES:
Oc1c2cccc3N=Nc(c23)c2ccccc12
: