Target
STE20-like serine/threonine-protein kinase
Ligand
BDBM50024294
Substrate
Meas. Tech.
ChEMBL_325019 (CHEMBL860653)
Kd
2300±n/a nM
Citation
 Fabian, MABiggs, WHTreiber, DKAtteridge, CEAzimioara, MDBenedetti, MGCarter, TACiceri, PEdeen, PTFloyd, MFord, JMGalvin, MGerlach, JLGrotzfeld, RMHerrgard, SInsko, DEInsko, MALai, AGLélias, JMMehta, SAMilanov, ZVVelasco, AMWodicka, LMPatel, HKZarrinkar, PPLockhart, DJ A small molecule-kinase interaction map for clinical kinase inhibitors. Nat Biotechnol 23:329-36 (2005)  
Target
Name:
STE20-like serine/threonine-protein kinase
Synonyms:
KIAA0204 SLK_HUMAN Serine/threonine-protein kinase 2
Type:
PROTEIN
Mol. Mass.:
142644.38
Organism:
Homo sapiens (Human)
Description:
ChEMBL_1451342
Residue:
1235
  
Inhibitor
Name:
BDBM50024294
Synonyms:
SP-600125
Type:
Small organic molecule
Emp. Form.:
C14H8N2O
Mol. Mass.:
220.2261
SMILES:
Oc1c2cccc3N=Nc(c23)c2ccccc12
: