Target
Serine/threonine-protein kinase 16
Ligand
BDBM50024294
Substrate
Meas. Tech.
ChEMBL_325047 (CHEMBL860783)
Kd
510±n/a nM
Citation
 Fabian, MABiggs, WHTreiber, DKAtteridge, CEAzimioara, MDBenedetti, MGCarter, TACiceri, PEdeen, PTFloyd, MFord, JMGalvin, MGerlach, JLGrotzfeld, RMHerrgard, SInsko, DEInsko, MALai, AGLélias, JMMehta, SAMilanov, ZVVelasco, AMWodicka, LMPatel, HKZarrinkar, PPLockhart, DJ A small molecule-kinase interaction map for clinical kinase inhibitors. Nat Biotechnol 23:329-36 (2005)  
Target
Name:
Serine/threonine-protein kinase 16
Synonyms:
MPSK1 STK16 Serine/threonine-protein kinase 16 Tyrosine-protein kinase STK16 (STK16)
Type:
Protein
Mol. Mass.:
34659.07
Organism:
Homo sapiens (Human)
Description:
Residue:
305
  
Inhibitor
Name:
BDBM50024294
Synonyms:
SP-600125
Type:
Small organic molecule
Emp. Form.:
C14H8N2O
Mol. Mass.:
220.2261
SMILES:
Oc1c2cccc3N=Nc(c23)c2ccccc12
: