Target
TRAF2 and NCK-interacting protein kinase
Ligand
BDBM50024294
Substrate
Meas. Tech.
ChEMBL_325007 (CHEMBL859485)
Kd
480±n/a nM
Citation
 Fabian, MABiggs, WHTreiber, DKAtteridge, CEAzimioara, MDBenedetti, MGCarter, TACiceri, PEdeen, PTFloyd, MFord, JMGalvin, MGerlach, JLGrotzfeld, RMHerrgard, SInsko, DEInsko, MALai, AGLélias, JMMehta, SAMilanov, ZVVelasco, AMWodicka, LMPatel, HKZarrinkar, PPLockhart, DJ A small molecule-kinase interaction map for clinical kinase inhibitors. Nat Biotechnol 23:329-36 (2005)  
Target
Name:
TRAF2 and NCK-interacting protein kinase
Synonyms:
KIAA0551 TNIK_HUMAN TRAF2- and NCK-interacting kinase
Type:
Protein
Mol. Mass.:
154954.98
Organism:
Homo sapiens (Human)
Description:
Q9UKE5
Residue:
1360
  
Inhibitor
Name:
BDBM50024294
Synonyms:
SP-600125
Type:
Small organic molecule
Emp. Form.:
C14H8N2O
Mol. Mass.:
220.2261
SMILES:
Oc1c2cccc3N=Nc(c23)c2ccccc12
: