Target
Melanocyte-stimulating hormone receptor
Ligand
BDBM50389769
Substrate
Meas. Tech.
ChEMBL_2194696 (CHEMBL5107056)
Ki
1.9±n/a nM
Citation
 White, AMDellsén, ALarsson, NKaas, QJansen, FPlowright, ATKnerr, LDurek, TCraik, DJ Late-Stage Functionalization with Cysteine Staples Generates Potent and Selective Melanocortin Receptor-1 Agonists. J Med Chem 65:12956-12969 (2022) Target
Name:
Melanocyte-stimulating hormone receptor
Synonyms:
MC1-R MSH-R MSHR_HUMAN Melanocortin receptor (M1 and M4) Melanocortin receptor 1 (MC1-R) | Melanocortin receptor 1 (MC1R)
Type:
Enzyme
Mol. Mass.:
34717.23
Organism:
Homo sapiens (Human)
Description:
Q01726
Residue:
317
  
Inhibitor
Name:
BDBM50389769
Synonyms:
BREMELANOTIDE
Type:
Small organic molecule
Emp. Form.:
C50H68N14O10
Mol. Mass.:
1025.1627
SMILES:
CCCC[C@H](NC(C)=O)C(=O)N[C@H]1CC(=O)NCCCC[C@H](NC(=O)[C@H](Cc2c[nH]c3ccccc23)NC(=O)[C@H](CCCN=C(N)N)NC(=O)[C@@H](Cc2ccccc2)NC(=O)[C@H](Cc2cnc[nH]2)NC1=O)C(O)=O
: