Target
Fatty-acid amide hydrolase 1
Ligand
BDBM23316
Substrate
Meas. Tech.
ChEMBL_305923 (CHEMBL833470)
IC50
0.3±n/a nM
Citation
 Leung, DDu, WHardouin, CCheng, HHwang, ICravatt, BFBoger, DL Discovery of an exceptionally potent and selective class of fatty acid amide hydrolase inhibitors enlisting proteome-wide selectivity screening: concurrent optimization of enzyme inhibitor potency and selectivity. Bioorg Med Chem Lett 15:1423-8 (2005)  
Target
Name:
Fatty-acid amide hydrolase 1
Synonyms:
Anandamide amidohydrolase FAAH FAAH1_HUMAN Fatty-acid amide hydrolase (FAAH) Oleamide hydrolase 1
Type:
Protein
Mol. Mass.:
63071.19
Organism:
Homo sapiens (Human)
Description:
O00519
Residue:
579
  
Inhibitor
Name:
BDBM23316
Synonyms:
7-phenyl-1-{pyrido[2,3-d][1,3]oxazol-2-yl}heptan-1-one OL-92
Type:
Small organic molecule
Emp. Form.:
C19H20N2O2
Mol. Mass.:
308.3743
SMILES:
O=C(CCCCCCc1ccccc1)c1nc2ncccc2o1
: