Target
Fatty-acid amide hydrolase 1
Ligand
BDBM50161518
Substrate
Meas. Tech.
ChEMBL_305923 (CHEMBL833470)
IC50
1±n/a nM
Citation
 Leung, DDu, WHardouin, CCheng, HHwang, ICravatt, BFBoger, DL Discovery of an exceptionally potent and selective class of fatty acid amide hydrolase inhibitors enlisting proteome-wide selectivity screening: concurrent optimization of enzyme inhibitor potency and selectivity. Bioorg Med Chem Lett 15:1423-8 (2005)  
Target
Name:
Fatty-acid amide hydrolase 1
Synonyms:
Anandamide amidohydrolase FAAH FAAH1_HUMAN Fatty-acid amide hydrolase (FAAH) Oleamide hydrolase 1
Type:
Protein
Mol. Mass.:
63071.19
Organism:
Homo sapiens (Human)
Description:
O00519
Residue:
579
  
Inhibitor
Name:
BDBM50161518
Synonyms:
1-(oxazolo[4,5-b]pyridin-2-yl)-6-phenylhexan-1-one CHEMBL175854
Type:
Small organic molecule
Emp. Form.:
C18H18N2O2
Mol. Mass.:
294.3477
SMILES:
O=C(CCCCCc1ccccc1)c1nc2ncccc2o1
: