Target
Liver carboxylesterase 1
Ligand
BDBM50073977
Substrate
Meas. Tech.
ChEMBL_305902 (CHEMBL832566)
IC50
2±n/a nM
Citation
 Leung, DDu, WHardouin, CCheng, HHwang, ICravatt, BFBoger, DL Discovery of an exceptionally potent and selective class of fatty acid amide hydrolase inhibitors enlisting proteome-wide selectivity screening: concurrent optimization of enzyme inhibitor potency and selectivity. Bioorg Med Chem Lett 15:1423-8 (2005)  
Target
Name:
Liver carboxylesterase 1
Synonyms:
Acyl coenzyme A:cholesterol acyltransferase CES1 EST1_HUMAN Serine hydrolase (CES1)
Type:
Protein
Mol. Mass.:
62520.83
Organism:
Homo sapiens (Human)
Description:
Residue:
567
  
Inhibitor
Name:
BDBM50073977
Synonyms:
1,1,1-Trifluoro-nonan-2-one CHEMBL93675
Type:
Small organic molecule
Emp. Form.:
C9H15F3O
Mol. Mass.:
196.21
SMILES:
CCCCCCCC(=O)C(F)(F)F
: