Target
Estrogen receptor beta
Ligand
BDBM50161696
Substrate
Meas. Tech.
ChEMBL_305295 (CHEMBL832843)
IC50
12.9±n/a nM
Citation
 Yang, CXu, GLi, JWu, XLiu, BYan, XWang, MXie, Y Benzothiophenes containing a piperazine side chain as selective ligands for the estrogen receptor alpha and their bioactivities in vivo. Bioorg Med Chem Lett 15:1505-7 (2005)  
Target
Name:
Estrogen receptor beta
Synonyms:
ER-beta ESR2_HUMAN Estradiol receptor beta (ERβ) Estrogen receptor (ER beta) Estrogen receptor beta (ER beta) NR3A2 estrogen beta
Type:
Protein
Mol. Mass.:
59238.43
Organism:
Homo sapiens (Human)
Description:
Q92731
Residue:
530
  
Inhibitor
Name:
BDBM50161696
Synonyms:
(4-{4-[6-Hydroxy-2-(4-hydroxy-phenyl)-benzo[b]thiophene-3-carbonyl]-phenyl}-piperazin-1-yl)-(2-nitro-phenyl)-methanone | CHEMBL360978
Type:
Small organic molecule
Emp. Form.:
C32H25N3O6S
Mol. Mass.:
579.622
SMILES:
Oc1ccc(cc1)-c1sc2cc(O)ccc2c1C(=O)c1ccc(cc1)N1CCN(CC1)C(=O)c1ccccc1[N+]([O-])=O
: