Target
Estrogen receptor beta
Ligand
BDBM50161709
Substrate
Meas. Tech.
ChEMBL_305295 (CHEMBL832843)
IC50
66.52±n/a nM
Citation
 Yang, CXu, GLi, JWu, XLiu, BYan, XWang, MXie, Y Benzothiophenes containing a piperazine side chain as selective ligands for the estrogen receptor alpha and their bioactivities in vivo. Bioorg Med Chem Lett 15:1505-7 (2005)  
Target
Name:
Estrogen receptor beta
Synonyms:
ER-beta ESR2_HUMAN Estradiol receptor beta (ERβ) Estrogen receptor (ER beta) Estrogen receptor beta (ER beta) NR3A2 estrogen beta
Type:
Protein
Mol. Mass.:
59238.43
Organism:
Homo sapiens (Human)
Description:
Q92731
Residue:
530
  
Inhibitor
Name:
BDBM50161709
Synonyms:
CHEMBL182237 | {4-[4-(4,6-Dimethyl-pyrimidin-2-yl)-piperazin-1-yl]-phenyl}-[6-hydroxy-2-(4-hydroxy-phenyl)-benzo[b]thiophen-3-yl]-methanone
Type:
Small organic molecule
Emp. Form.:
C31H28N4O3S
Mol. Mass.:
536.644
SMILES:
Cc1cc(C)nc(n1)N1CCN(CC1)c1ccc(cc1)C(=O)c1c(sc2cc(O)ccc12)-c1ccc(O)cc1
: