Target
Thymidylate synthase
Ligand
BDBM50590310
Substrate
Meas. Tech.
ChEMBL_2196079 (CHEMBL5108595)
Kd
120000±n/a nM
Citation
 Marverti, GMarraccini, CMartello, AD'Arca, DPacifico, SGuerrini, RSpyrakis, FGozzi, GLauriola, ASantucci, MCannazza, GTagliazucchi, LCazzato, ASLosi, LFerrari, SPonterini, GCosti, MP Folic Acid-Peptide Conjugates Combine Selective Cancer Cell Internalization with Thymidylate Synthase Dimer Interface Targeting. J Med Chem 64:3204-3221 (2021) Target
Name:
Thymidylate synthase
Synonyms:
TS TYMS Thymidylate synthase (TS) | Thymidylate synthase/GAR transformylase/AICAR transformylase
Type:
Enzyme
Mol. Mass.:
35718.07
Organism:
Homo sapiens (Human)
Description:
Residue:
313
  
Inhibitor
Name:
BDBM50590310
Synonyms:
CHEMBL5195943
Type:
Small organic molecule
Emp. Form.:
C62H88N20O18S
Mol. Mass.:
1433.55
SMILES:
CC(C)C[C@H](NC(=O)CC[C@H](NC(=O)c1ccc(NCc2cnc3nc(N)[nH]c(=O)c3n2)cc1)C(O)=O)C(=O)N[C@@H](CO)C(=O)N[C@@H](CS)C(=O)N[C@H](CCC(N)=O)C(=O)N[C@@H](CC(C)C)C(=O)N[C@@H](Cc1ccc(O)cc1)C(=O)N[C@@H](CCC(N)=O)C(=O)N[C@@H](CCCNC(N)=N)C(O)=O
: