Target
Sortase family protein
Ligand
BDBM50590366
Substrate
Meas. Tech.
ChEMBL_2196378 (CHEMBL5108894)
IC50
500±n/a nM
Citation
 Guan, XNZhang, TYang, TDong, ZYang, SLan, LGan, JYang, CG Covalent sortase A inhibitor ML346 prevents  RSC Med Chem 13:138-149 (2022) Target
Name:
Sortase family protein
Synonyms:
Sortase | Sortase A (SrtA)
Type:
Enzyme
Mol. Mass.:
23546.15
Organism:
Staphylococcus aureus
Description:
Residue:
206
  
Inhibitor
Name:
BDBM50590366
Synonyms:
CHEMBL5174805
Type:
Small organic molecule
Emp. Form.:
C14H12N2O4
Mol. Mass.:
272.2561
SMILES:
[#6]-[#8]-c1ccc(\[#6]=[#6]\[#6]=[#6]-2/[#6](=O)-[#7]-[#6](=O)-[#7]-[#6]-2=O)cc1
: