Target
Melanin-concentrating hormone receptor 1
Ligand
BDBM50162112
Substrate
Meas. Tech.
ChEMBL_306622 (CHEMBL829924)
IC50
299±n/a nM
Citation
 Souers, AJGao, JBrune, MBush, EWodka, DVasudevan, AJudd, ASMulhern, MBrodjian, SDayton, BShapiro, RHernandez, LEMarsh, KCSham, HLCollins, CAKym, PR Identification of 2-(4-benzyloxyphenyl)-N- [1-(2-pyrrolidin-1-yl-ethyl)-1H-indazol-6-yl]acetamide, an orally efficacious melanin-concentrating hormone receptor 1 antagonist for the treatment of obesity. J Med Chem 48:1318-21 (2005)  
Target
Name:
Melanin-concentrating hormone receptor 1
Synonyms:
G-protein coupled receptor 24 MCH receptor 1 MCH-R1 MCHR-1 MCHR1_HUMAN Melanin-Concentrating Hormone Receptor 1 (MCH1R) Melanin-concentrating hormone receptor 1 (MCH-1) Melanin-concentrating hormone receptor 1 (MCHR-1) SLC-1 Somatostatin receptor-like protein
Type:
G Protein-Coupled Receptor (GPCR)
Mol. Mass.:
45976.27
Organism:
Homo sapiens (Human)
Description:
Membranes from CHO-K1 cells stably expressing human MCH1R were used in assays.
Residue:
422
  
Inhibitor
Name:
BDBM50162112
Synonyms:
2-(4-Phenoxy-benzylamino)-N-[3-(2-pyrrolidin-1-yl-ethyl)-3H-benzoimidazol-5-yl]-acetamide | CHEMBL176081
Type:
Small organic molecule
Emp. Form.:
C28H31N5O2
Mol. Mass.:
469.578
SMILES:
O=C(CNCc1ccc(Oc2ccccc2)cc1)Nc1ccc2ncn(CCN3CCCC3)c2c1
: